Target
G-protein coupled bile acid receptor 1
Ligand
BDBM50437885
Substrate
Meas. Tech.
ChEMBL_974032 (CHEMBL2410510)
EC50
12±n/a nM
Citation
 Dehmlow, HAlvarez Sánchez, RBachmann, SBissantz, CBliss, FConde-Knape, KGraf, MMartin, REObst Sander, URaab, SRichter, HGSewing, SSprecher, UUllmer, CMattei, P Discovery and optimisation of 1-hydroxyimino-3,3-diphenylpropanes, a new class of orally active GPBAR1 (TGR5) agonists. Bioorg Med Chem Lett 23:4627-32 (2013)  
Target
Name:
G-protein coupled bile acid receptor 1
Synonyms:
BG37 GPBAR_HUMAN TGR5 hGPCR19
Type:
G Protein-Coupled Receptor (GPCR)
Mol. Mass.:
35260.02
Organism:
Homo sapiens (Human)
Description:
CHO cells transiently transfected with hTGR5.
Residue:
330
  
Inhibitor
Name:
BDBM50437885
Synonyms:
CHEMBL2407949
Type:
Small organic molecule
Emp. Form.:
C21H19BrN2O
Mol. Mass.:
395.292
SMILES:
Cc1ccccc1C(CC(N=O)c1ccncc1)c1ccc(Br)cc1
: