Target
G-protein coupled bile acid receptor 1
Ligand
BDBM50437894
Substrate
Meas. Tech.
ChEMBL_974032 (CHEMBL2410510)
EC50
>10000±n/a nM
Citation
 Dehmlow, HAlvarez Sánchez, RBachmann, SBissantz, CBliss, FConde-Knape, KGraf, MMartin, REObst Sander, URaab, SRichter, HGSewing, SSprecher, UUllmer, CMattei, P Discovery and optimisation of 1-hydroxyimino-3,3-diphenylpropanes, a new class of orally active GPBAR1 (TGR5) agonists. Bioorg Med Chem Lett 23:4627-32 (2013)  
Target
Name:
G-protein coupled bile acid receptor 1
Synonyms:
BG37 GPBAR_HUMAN TGR5 hGPCR19
Type:
G Protein-Coupled Receptor (GPCR)
Mol. Mass.:
35260.02
Organism:
Homo sapiens (Human)
Description:
CHO cells transiently transfected with hTGR5.
Residue:
330
  
Inhibitor
Name:
BDBM50437894
Synonyms:
CHEMBL2407941
Type:
Small organic molecule
Emp. Form.:
C23H23FN2O
Mol. Mass.:
362.4399
SMILES:
CN(C)c1ccc(cc1)C(CC(N=O)c1ccc(F)cc1)c1ccccc1
: