Target
G protein-activated inward rectifier potassium channel 1
Ligand
BDBM50437983
Substrate
Meas. Tech.
ChEMBL_972875 (CHEMBL2411652)
EC50
160±n/a nM
Citation
 Wen, WWu, WRomaine, IMKaufmann, KDu, YSulikowski, GAWeaver, CDLindsley, CW Discovery of 'molecular switches' within a GIRK activator scaffold that afford selective GIRK inhibitors. Bioorg Med Chem Lett 23:4562-6 (2013)  
Target
Name:
G protein-activated inward rectifier potassium channel 1
Synonyms:
GIRK-1 Inward rectifier K(+) channel Kir3.1 KCNJ3_HUMAN | Potassium channel, inwardly rectifying subfamily J member 3
Type:
PROTEIN
Mol. Mass.:
56610.74
Organism:
Homo sapiens (Human)
Description:
ChEMBL_107915
Residue:
501
  
Inhibitor
Name:
BDBM50437983
Synonyms:
CHEMBL2409106
Type:
Small organic molecule
Emp. Form.:
C17H14F2N4O
Mol. Mass.:
328.3161
SMILES:
Cc1cc(NC(=O)Nc2ccc(F)c(F)c2)n(n1)-c1ccccc1
: