Target
G protein-activated inward rectifier potassium channel 1
Ligand
BDBM50437971
Substrate
Meas. Tech.
ChEMBL_972866 (CHEMBL2411643)
EC50
350±n/a nM
Citation
 Wen, WWu, WRomaine, IMKaufmann, KDu, YSulikowski, GAWeaver, CDLindsley, CW Discovery of 'molecular switches' within a GIRK activator scaffold that afford selective GIRK inhibitors. Bioorg Med Chem Lett 23:4562-6 (2013)  
Target
Name:
G protein-activated inward rectifier potassium channel 1
Synonyms:
GIRK-1 Inward rectifier K(+) channel Kir3.1 KCNJ3_HUMAN | Potassium channel, inwardly rectifying subfamily J member 3
Type:
PROTEIN
Mol. Mass.:
56610.74
Organism:
Homo sapiens (Human)
Description:
ChEMBL_107915
Residue:
501
  
Inhibitor
Name:
BDBM50437971
Synonyms:
CHEMBL2409131
Type:
Small organic molecule
Emp. Form.:
C20H19FN4O
Mol. Mass.:
350.3895
SMILES:
Fc1ccc(NC(=O)Nc2cc(nn2Cc2ccccc2)C2CC2)cc1
: