Target
Acetylpolyamine amidohydrolase
Ligand
BDBM50438390
Substrate
Meas. Tech.
ChEMBL_975718 (CHEMBL2415216)
IC50
270±n/a nM
Citation
 Decroos, CBowman, CMChristianson, DW Synthesis and evaluation of N8-acetylspermidine analogues as inhibitors of bacterial acetylpolyamine amidohydrolase. Bioorg Med Chem 21:4530-40 (2013)  
Target
Name:
Acetylpolyamine amidohydrolase
Synonyms:
APAH_MYCRA Acetylpolyamine aminohydrolase aphA
Type:
Protein
Mol. Mass.:
36324.64
Organism:
Mycoplana ramosa (Gram-negative bacterium)
Description:
Residue:
341
  
Inhibitor
Name:
BDBM50438390
Synonyms:
CHEMBL2414000
Type:
Small organic molecule
Emp. Form.:
C10H19F3N2O
Mol. Mass.:
240.2659
SMILES:
NCCCNCCCCCC(=O)C(F)(F)F
: