Target
Ribonuclease pancreatic
Ligand
BDBM50438449
Substrate
Meas. Tech.
ChEMBL_975987 (CHEMBL2415636)
Ki
757000±n/a nM
Citation
 Datta, DSamanta, ADasgupta, SPathak, T 3'-Oxo-, amino-, thio- and sulfone-acetic acid modified thymidines: effect of increased acidity on ribonuclease A inhibition. Bioorg Med Chem 21:4634-45 (2013)  
Target
Name:
Ribonuclease pancreatic
Synonyms:
CAM-RNase A RNASE1 RNS1
Type:
Enzyme
Mol. Mass.:
16468.79
Organism:
Bison bison (American bison)
Description:
carboxamidomethylated RNase A
Residue:
150
  
Inhibitor
Name:
BDBM50438449
Synonyms:
CHEMBL2414512
Type:
Small organic molecule
Emp. Form.:
C13H18N2O6S
Mol. Mass.:
330.357
SMILES:
COC(=O)CS[C@H]1C[C@@H](O[C@@H]1CO)n1cc(C)c(=O)[nH]c1=O
: