Target
Cholinesterase
Ligand
BDBM50438542
Substrate
Meas. Tech.
ChEMBL_976315 (CHEMBL2415261)
Ki
212400±n/a nM
Citation
 Sinha, SKShrivastava, SK Synthesis, evaluation and molecular dynamics study of some new 4-aminopyridine semicarbazones as an antiamnesic and cognition enhancing agents. Bioorg Med Chem 21:5451-60 (2013)  
Target
Name:
Cholinesterase
Synonyms:
Acylcholine acylhydrolase Butyrylcholine esterase (BChE) Butyrylcholinesterase (BuChE) CHLE_HUMAN Cholinesterases Pseudocholinesterase
Type:
Homotetramer
Mol. Mass.:
68422.27
Organism:
Homo sapiens (Human)
Description:
P06276
Residue:
602
  
Inhibitor
Name:
BDBM50438542
Synonyms:
CHEMBL2414857
Type:
Small organic molecule
Emp. Form.:
C13H12N4O2
Mol. Mass.:
256.26
SMILES:
Oc1ccccc1C=NNC(=O)Nc1ccncc1
: