Target
Phosphatidylinositol 4,5-bisphosphate 3-kinase catalytic subunit alpha isoform
Ligand
BDBM50438632
Substrate
Meas. Tech.
ChEMBL_976068 (CHEMBL2415717)
Ki
157±n/a nM
Citation
 Safina, BSSweeney, ZKLi, JChan, BKBisconte, ACarrera, DCastanedo, GFlagella, MHeald, RLewis, CMurray, JMNonomiya, JPang, JPrice, SReif, KSalphati, LSeward, EMWei, BSutherlin, DP Identification of GNE-293, a potent and selective PI3Kd inhibitor: navigating in vitro genotoxicity while improving potency and selectivity. Bioorg Med Chem Lett 23:4953-9 (2013)  
Target
Name:
Phosphatidylinositol 4,5-bisphosphate 3-kinase catalytic subunit alpha isoform
Synonyms:
P42336 PI3-kinase subunit p110-alpha PIK3CA Phosphatidylinositol 3-kinase alpha (PI3Kalpha) Phosphatidylinositol 4,5-bisphosphate 3-kinase (PI3K) Phosphatidylinositol 4,5-bisphosphate 3-kinase catalytic subunit alpha (PI3Kalpha) Phosphatidylinositol 4,5-bisphosphate 3-kinase catalytic subunit alpha isoform (PI3-Ka) Phosphatidylinositol 4,5-bisphosphate 3-kinase catalytic subunit alpha isoform (PI3K p110alpha) Phosphatidylinositol 4,5-bisphosphate 3-kinase catalytic subunit alpha isoform (PI3K-alpha) Phosphatidylinositol 4,5-bisphosphate 3-kinase catalytic subunit alpha isoform (PI3Kalpha p110alpha) Phosphatidylinositol 4,5-bisphosphate 3-kinase catalytic subunit alpha isoform (PIK3CA) Phosphatidylinositol-4,5-bisphosphate 3-kinase catalytic subunit alpha isoform Phosphoinositide 3-Kinase (PI3K), alpha Chain A Phosphoinositide 3-kinases (PI3K) PtdIns-3-kinase p110 | p110 alpha
Type:
Enzyme Subunit
Mol. Mass.:
124294.87
Organism:
Homo sapiens (Human)
Description:
P42336
Residue:
1068
  
Inhibitor
Name:
BDBM50438632
Synonyms:
CHEMBL2414295
Type:
Small organic molecule
Emp. Form.:
C29H36N8O3S
Mol. Mass.:
576.713
SMILES:
CCc1nc2ccccc2n1-c1nc(N2CCOCC2)c2sc(C(=O)N3CCN(CC3)C(C)(C)C(N)=O)c(C)c2n1
: