Target
Phosphatidylinositol 4,5-bisphosphate 3-kinase catalytic subunit delta isoform
Ligand
BDBM50396642
Substrate
Meas. Tech.
ChEMBL_976122 (CHEMBL2415771)
Ki
1.8±n/a nM
Citation
 Safina, BSSweeney, ZKLi, JChan, BKBisconte, ACarrera, DCastanedo, GFlagella, MHeald, RLewis, CMurray, JMNonomiya, JPang, JPrice, SReif, KSalphati, LSeward, EMWei, BSutherlin, DP Identification of GNE-293, a potent and selective PI3Kd inhibitor: navigating in vitro genotoxicity while improving potency and selectivity. Bioorg Med Chem Lett 23:4953-9 (2013)  
Target
Name:
Phosphatidylinositol 4,5-bisphosphate 3-kinase catalytic subunit delta isoform
Synonyms:
PI3-kinase p110 subunit delta PI3-kinase subunit p110-delta PIK3CD Phosphatidylinositol 4,5-biphosphate 3-kinase catalytic subunit delta (PIK3CD) Phosphatidylinositol 4,5-bisphosphate 3-kinase 110 kDa catalytic subunit delta (PI3K delta) Phosphatidylinositol 4,5-bisphosphate 3-kinase catalytic subunit delta (PI3Kdelta) Phosphatidylinositol 4,5-bisphosphate 3-kinase catalytic subunit delta isoform (PI3K delta) Phosphatidylinositol 4,5-bisphosphate 3-kinase catalytic subunit delta isoform (PI3K-delta) Phosphatidylinositol 4,5-bisphosphate 3-kinase catalytic subunit delta isoform (PI3Kdelta)
Type:
Enzyme Subunit
Mol. Mass.:
119489.41
Organism:
Homo sapiens (Human)
Description:
O00329
Residue:
1044
  
Inhibitor
Name:
BDBM50396642
Synonyms:
CHEMBL2171939
Type:
Small organic molecule
Emp. Form.:
C28H38N10O2
Mol. Mass.:
546.6671
SMILES:
CCc1nc2ccccc2n1-c1nc(N2CCOCC2)c2nc(CN3CCN(CC3)C(C)(C)C(N)=O)n(C)c2n1
: