Target
Orexin receptor type 2
Ligand
BDBM50438817
Substrate
Meas. Tech.
ChEMBL_977024 (CHEMBL2416548)
IC50
194±n/a nM
Citation
 Lebold, TPBonaventure, PShireman, BT Selective orexin receptor antagonists. Bioorg Med Chem Lett 23:4761-9 (2013)  
Target
Name:
Orexin receptor type 2
Synonyms:
HCRTR2 OX2R_HUMAN Orexin receptor type 2 (OR-2) Orexin receptor type 2 (OX2R) Ox-2-R | Ox2-R
Type:
Protein
Mol. Mass.:
50710.53
Organism:
Homo sapiens (Human)
Description:
O43614
Residue:
444
  
Inhibitor
Name:
BDBM50438817
Synonyms:
CHEMBL2413372
Type:
Small organic molecule
Emp. Form.:
C24H22FN3O3S
Mol. Mass.:
451.513
SMILES:
CN(Cc1ccc(F)cc1)C(=O)Cc1nc(c2ccccn12)S(=O)(=O)Cc1ccccc1
: