Target
Cholinesterase
Ligand
BDBM50438830
Substrate
Meas. Tech.
ChEMBL_977209 (CHEMBL2416839)
IC50
1370±n/a nM
Citation
 Alpan, ASParlar, SCarlino, LTarikogullari, AHAlptüzün, VGünes, HS Synthesis, biological activity and molecular modeling studies on 1H-benzimidazole derivatives as acetylcholinesterase inhibitors. Bioorg Med Chem 21:4928-37 (2013)  
Target
Name:
Cholinesterase
Synonyms:
BCHE CHLE_HORSE | Cholinesterase
Type:
Enzyme
Mol. Mass.:
65643.35
Organism:
Equus caballus (Horse)
Description:
P81908
Residue:
574
  
Inhibitor
Name:
BDBM50438830
Synonyms:
CHEMBL2413736
Type:
Small organic molecule
Emp. Form.:
C21H25N3O
Mol. Mass.:
335.4427
SMILES:
Cc1ccc2nc([nH]c2c1)-c1ccc(OCCN2CCCCC2)cc1
: