Target
Cholinesterase
Ligand
BDBM50438841
Substrate
Meas. Tech.
ChEMBL_977209 (CHEMBL2416839)
IC50
4590±n/a nM
Citation
 Alpan, ASParlar, SCarlino, LTarikogullari, AHAlptüzün, VGünes, HS Synthesis, biological activity and molecular modeling studies on 1H-benzimidazole derivatives as acetylcholinesterase inhibitors. Bioorg Med Chem 21:4928-37 (2013)  
Target
Name:
Cholinesterase
Synonyms:
BCHE CHLE_HORSE | Cholinesterase
Type:
Enzyme
Mol. Mass.:
65643.35
Organism:
Equus caballus (Horse)
Description:
P81908
Residue:
574
  
Inhibitor
Name:
BDBM50438841
Synonyms:
CHEMBL377740
Type:
Small organic molecule
Emp. Form.:
C13H10N2O
Mol. Mass.:
210.2313
SMILES:
Oc1ccc(cc1)-c1nc2ccccc2[nH]1
: