Target
Acetylcholinesterase
Ligand
BDBM50438826
Substrate
Meas. Tech.
ChEMBL_977211 (CHEMBL2416841)
IC50
3500±n/a nM
Citation
 Alpan, ASParlar, SCarlino, LTarikogullari, AHAlptüzün, VGünes, HS Synthesis, biological activity and molecular modeling studies on 1H-benzimidazole derivatives as acetylcholinesterase inhibitors. Bioorg Med Chem 21:4928-37 (2013)  
Target
Name:
Acetylcholinesterase
Synonyms:
ACES_ELEEL Acetylcholinesterase (EeAChE) | ache
Type:
Enzyme
Mol. Mass.:
71812.79
Organism:
Electrophorus electricus (Electric eel)
Description:
Residue:
633
  
Inhibitor
Name:
BDBM50438826
Synonyms:
CHEMBL2413740
Type:
Small organic molecule
Emp. Form.:
C19H22ClN3O
Mol. Mass.:
343.85
SMILES:
CCN(CC)CCOc1ccc(cc1)-c1nc2ccc(Cl)cc2[nH]1
: