Target
Nuclear receptor corepressor 1
Ligand
BDBM50354086
Substrate
Meas. Tech.
ChEMBL_979440 (CHEMBL2423476)
Ki
0.150000±n/a nM
Citation
 Villadsen, JSStephansen, HMMaolanon, ARHarris, POlsen, CA Total synthesis and full histone deacetylase inhibitory profiling of Azumamides A-E as well as߲- epi-Azumamide E and߳-epi-Azumamide E. J Med Chem 56:6512-20 (2013)  
Target
Name:
Nuclear receptor corepressor 1
Synonyms:
KIAA1047 N-CoR1 NCOR1_HUMAN
Type:
PROTEIN
Mol. Mass.:
270226.27
Organism:
Homo sapiens (Human)
Description:
ChEMBL_107910
Residue:
2440
  
Inhibitor
Name:
BDBM50354086
Synonyms:
FK-228 ROMIDEPSIN
Type:
Small organic molecule
Emp. Form.:
C25H39N3O6S2
Mol. Mass.:
541.724
SMILES:
C\C=C1/NC(=O)[C@@H](CS)NC(=O)[C@H](CC(=O)C[C@H](OC(=O)[C@@H](NC1=O)C(C)C)\C=C\CCS)C(C)C
: