Target
Nuclear receptor corepressor 1
Ligand
BDBM50372469
Substrate
Meas. Tech.
ChEMBL_979440 (CHEMBL2423476)
Ki
25±n/a nM
Citation
 Villadsen, JSStephansen, HMMaolanon, ARHarris, POlsen, CA Total synthesis and full histone deacetylase inhibitory profiling of Azumamides A-E as well as߲- epi-Azumamide E and߳-epi-Azumamide E. J Med Chem 56:6512-20 (2013)  
Target
Name:
Nuclear receptor corepressor 1
Synonyms:
KIAA1047 N-CoR1 NCOR1_HUMAN
Type:
PROTEIN
Mol. Mass.:
270226.27
Organism:
Homo sapiens (Human)
Description:
ChEMBL_107910
Residue:
2440
  
Inhibitor
Name:
BDBM50372469
Synonyms:
AZUMAMIDE E
Type:
Small organic molecule
Emp. Form.:
C27H38N4O6
Mol. Mass.:
514.6138
SMILES:
CC(C)[C@H]1NC(=O)[C@@H](C)[C@@H](CC=CCCC(O)=O)NC(=O)[C@@H](Cc2ccccc2)NC(=O)[C@@H](C)NC1=O
: