Target
Kinesin-like protein KIF11
Ligand
BDBM50427294
Substrate
Meas. Tech.
ChEMBL_977859 (CHEMBL2421461)
IC50
0.140000±n/a nM
Citation
 Talapatra, SKAnthony, NGMackay, SPKozielski, F Mitotic kinesin Eg5 overcomes inhibition to the phase I/II clinical candidate SB743921 by an allosteric resistance mechanism. J Med Chem 56:6317-29 (2013)  
Target
Name:
Kinesin-like protein KIF11
Synonyms:
EG5 KIF11_HUMAN Kinesin Spindle Protein Eg5 TRIP5 | kinesin spindle protein
Type:
PROTEIN
Mol. Mass.:
119138.97
Organism:
Homo sapiens (Human)
Description:
ChEMBL_1457426
Residue:
1056
  
Inhibitor
Name:
BDBM50427294
Synonyms:
CHEMBL2325429 | SB-743921
Type:
Small organic molecule
Emp. Form.:
C31H33ClN2O3
Mol. Mass.:
517.058
SMILES:
CC(C)[C@@H](N(CCCN)C(=O)c1ccc(C)cc1)c1oc2cc(Cl)ccc2c(=O)c1Cc1ccccc1
: