Target
Tyrosine-protein kinase SYK
Ligand
BDBM50126403
Substrate
Meas. Tech.
ChEMBL_983771 (CHEMBL2428110)
IC50
420±n/a nM
Citation
 Kaur, MSingh, MSilakari, O Inhibitors of switch kinase 'spleen tyrosine kinase' in inflammation and immune-mediated disorders: a review. Eur J Med Chem 67:434-46 (2013)  
Target
Name:
Tyrosine-protein kinase SYK
Synonyms:
KSYK_HUMAN Spleen Tyrosine Kinase Tyrosine-protein kinase SYK (Syk)
Type:
Enzyme
Mol. Mass.:
72079.99
Organism:
Homo sapiens (Human)
Description:
P43405
Residue:
635
  
Inhibitor
Name:
BDBM50126403
Synonyms:
CHEMBL33009 | N*1*-(7-{4-[(3-Dimethylamino-propyl)-methyl-amino]-phenyl}-[1,6]naphthyridin-5-yl)-propane-1,3-diamine
Type:
Small organic molecule
Emp. Form.:
C23H32N6
Mol. Mass.:
392.5404
SMILES:
CN(C)CCCN(C)c1ccc(cc1)-c1cc2ncccc2c(NCCCN)n1
: