Target
Cyclin-dependent kinase 7
Ligand
BDBM50440138
Substrate
Meas. Tech.
ChEMBL_981180 (CHEMBL2427173)
IC50
1788±n/a nM
Citation
 Sun, JLv, XHQiu, HYWang, YTDu, QRLi, DDYang, YHZhu, HL Synthesis, biological evaluation and molecular docking studies of pyrazole derivatives coupling with a thiourea moiety as novel CDKs inhibitors. Eur J Med Chem 68:1-9 (2013)  
Target
Name:
Cyclin-dependent kinase 7
Synonyms:
39 kDa protein kinase CAK1 CDK-activating kinase 1 (CAK) CDK7_HUMAN Cell division protein kinase 7 Cyclin-dependent kinase 7 (CDK7/cyclin H) P39 Mo15 TFIIH basal transcription factor complex kinase subunit
Type:
Enzyme Subunit
Mol. Mass.:
39047.01
Organism:
Homo sapiens (Human)
Description:
Residue:
346
  
Inhibitor
Name:
BDBM50440138
Synonyms:
CHEMBL2426383
Type:
Small organic molecule
Emp. Form.:
C25H22N4O2S
Mol. Mass.:
442.533
SMILES:
COc1ccc(NC(=S)NC(=O)c2cn(nc2-c2ccc(C)cc2)-c2ccccc2)cc1
: