Target
Cyclin-dependent kinase 6
Ligand
BDBM50440138
Substrate
Meas. Tech.
ChEMBL_981181 (CHEMBL2427321)
IC50
43±n/a nM
Citation
 Sun, JLv, XHQiu, HYWang, YTDu, QRLi, DDYang, YHZhu, HL Synthesis, biological evaluation and molecular docking studies of pyrazole derivatives coupling with a thiourea moiety as novel CDKs inhibitors. Eur J Med Chem 68:1-9 (2013)  
Target
Name:
Cyclin-dependent kinase 6
Synonyms:
CDK6 CDKN6 Cyclin-dependent kinase 6 (CDK 6) | Serine/threonine-protein kinase PLSTIRE
Type:
Enzyme Subunit
Mol. Mass.:
36937.42
Organism:
Homo sapiens (Human)
Description:
Q00534
Residue:
326
  
Inhibitor
Name:
BDBM50440138
Synonyms:
CHEMBL2426383
Type:
Small organic molecule
Emp. Form.:
C25H22N4O2S
Mol. Mass.:
442.533
SMILES:
COc1ccc(NC(=S)NC(=O)c2cn(nc2-c2ccc(C)cc2)-c2ccccc2)cc1
: