Target
Cyclin-dependent kinase 5
Ligand
BDBM50440136
Substrate
Meas. Tech.
ChEMBL_981182 (CHEMBL2427322)
IC50
1178±n/a nM
Citation
 Sun, JLv, XHQiu, HYWang, YTDu, QRLi, DDYang, YHZhu, HL Synthesis, biological evaluation and molecular docking studies of pyrazole derivatives coupling with a thiourea moiety as novel CDKs inhibitors. Eur J Med Chem 68:1-9 (2013)  
Target
Name:
Cyclin-dependent kinase 5
Synonyms:
CDK5 CDKN5 Cyclin-dependent kinase 5 (CDK5/ p25) Cyclin-dependent-like kinase 5 PSSALRE Tau protein kinase II catalytic subunit
Type:
Enzyme Subunit
Mol. Mass.:
33308.61
Organism:
Homo sapiens (Human)
Description:
Residue:
292
  
Inhibitor
Name:
BDBM50440136
Synonyms:
CHEMBL2426391
Type:
Small organic molecule
Emp. Form.:
C24H19FN4O2S
Mol. Mass.:
446.497
SMILES:
COc1ccc(NC(=S)NC(=O)c2cn(nc2-c2ccc(F)cc2)-c2ccccc2)cc1
: