Target
Cyclin-dependent kinase 1
Ligand
BDBM50440136
Substrate
Meas. Tech.
ChEMBL_981183 (CHEMBL2427323)
IC50
569±n/a nM
Citation
 Sun, JLv, XHQiu, HYWang, YTDu, QRLi, DDYang, YHZhu, HL Synthesis, biological evaluation and molecular docking studies of pyrazole derivatives coupling with a thiourea moiety as novel CDKs inhibitors. Eur J Med Chem 68:1-9 (2013)  
Target
Name:
Cyclin-dependent kinase 1
Synonyms:
CDC2 CDK1 CDKN1 Cell division protein kinase 1 P34CDC2 | p34 protein kinase
Type:
Enzyme Subunit
Mol. Mass.:
34101.08
Organism:
Homo sapiens (Human)
Description:
P06493
Residue:
297
  
Inhibitor
Name:
BDBM50440136
Synonyms:
CHEMBL2426391
Type:
Small organic molecule
Emp. Form.:
C24H19FN4O2S
Mol. Mass.:
446.497
SMILES:
COc1ccc(NC(=S)NC(=O)c2cn(nc2-c2ccc(F)cc2)-c2ccccc2)cc1
: