Target
Tyrosine-protein phosphatase non-receptor type 6
Ligand
BDBM53072
Substrate
Meas. Tech.
ChEMBL_984734 (CHEMBL2432108)
IC50
39500±n/a nM
Citation
 Liu, WYu, BXu, GXu, WRLoh, MLTang, LDQu, CK Identification of cryptotanshinone as an inhibitor of oncogenic protein tyrosine phosphatase SHP2 (PTPN11). J Med Chem 56:7212-21 (2013)  
Target
Name:
Tyrosine-protein phosphatase non-receptor type 6
Synonyms:
HCP PTP1C Protein tyrosine phosphatase SHP-1 (SHP-1) Protein-tyrosine phosphatase SHP-1 Tyrosine-protein phosphatase non-receptor type 6 | Tyrosine-protein phosphatase non-receptor type 6 (SHP1)
Type:
Protein
Mol. Mass.:
67570.41
Organism:
Homo sapiens (Human)
Description:
P29350
Residue:
595
  
Inhibitor
Name:
BDBM53072
Synonyms:
(5Z)-3-allyl-5-(3-ethyl-1,3-benzothiazol-2-ylidene)-2-thioxo-thiazolidin-4-one (5Z)-5-(3-ethyl-1,3-benzothiazol-2-ylidene)-3-prop-2-enyl-2-sulfanylidene-4-thiazolidinone MLS001210616 cid_3094418
Type:
Small organic molecule
Emp. Form.:
C15H14N2OS3
Mol. Mass.:
334.479
SMILES:
CCN1\C(Sc2ccccc12)=C1\SC(=S)N(CC=C)C1=O
: