Target
Calcitonin gene-related peptide type 1 receptor
Ligand
BDBM50441033
Substrate
Meas. Tech.
ChEMBL_985765 (CHEMBL2433982)
IC50
0.390000±n/a nM
Citation
 Tora, GDegnan, APConway, CMKostich, WADavis, CDPin, SSSchartman, RXu, CWidmann, KAMacor, JEDubowchik, GM Preparation of imidazoles as potent calcitonin gene-related peptide (CGRP) antagonists. Bioorg Med Chem Lett 23:5684-8 (2013)  
Target
Name:
Calcitonin gene-related peptide type 1 receptor
Synonyms:
Adrenomedullin receptor AM1; CALCRL/RAMP2 CALRL_HUMAN CGRP type 1 receptor mRNA Calcitonin gene-related peptide (CGRP) receptor Calcitonin receptor-like receptor Human CL receptor
Type:
Enzyme Catalytic Domain
Mol. Mass.:
52980.45
Organism:
Homo sapiens (Human)
Description:
Q16602
Residue:
461
  
Inhibitor
Name:
BDBM50441033
Synonyms:
CHEMBL2430178
Type:
Small organic molecule
Emp. Form.:
C34H34F2N8O2
Mol. Mass.:
624.683
SMILES:
Cc1cc(CC(NC(=O)N2CCC(CC2)N2Cc3ccccc3NC2=O)c2nccn2Cc2cc(F)cc(F)c2)cc2cn[nH]c12
: