Target
Calcitonin gene-related peptide type 1 receptor
Ligand
BDBM50441043
Substrate
Meas. Tech.
ChEMBL_985765 (CHEMBL2433982)
IC50
0.260000±n/a nM
Citation
 Tora, GDegnan, APConway, CMKostich, WADavis, CDPin, SSSchartman, RXu, CWidmann, KAMacor, JEDubowchik, GM Preparation of imidazoles as potent calcitonin gene-related peptide (CGRP) antagonists. Bioorg Med Chem Lett 23:5684-8 (2013)  
Target
Name:
Calcitonin gene-related peptide type 1 receptor
Synonyms:
Adrenomedullin receptor AM1; CALCRL/RAMP2 CALRL_HUMAN CGRP type 1 receptor mRNA Calcitonin gene-related peptide (CGRP) receptor Calcitonin receptor-like receptor Human CL receptor
Type:
Enzyme Catalytic Domain
Mol. Mass.:
52980.45
Organism:
Homo sapiens (Human)
Description:
Q16602
Residue:
461
  
Inhibitor
Name:
BDBM50441043
Synonyms:
CHEMBL2430165 | US9695176, 1
Type:
Small organic molecule
Emp. Form.:
C38H39N7O3
Mol. Mass.:
641.7614
SMILES:
Cc1cc(CC(OC(=O)N2CCC(CC2)c2cc3ccccc3[nH]c2=O)c2ncc3CN(Cc4ccccc4)CCn23)cc2cn[nH]c12
: