Target
Calcitonin gene-related peptide type 1 receptor
Ligand
BDBM50441049
Substrate
Meas. Tech.
ChEMBL_985765 (CHEMBL2433982)
IC50
1.6±n/a nM
Citation
 Tora, GDegnan, APConway, CMKostich, WADavis, CDPin, SSSchartman, RXu, CWidmann, KAMacor, JEDubowchik, GM Preparation of imidazoles as potent calcitonin gene-related peptide (CGRP) antagonists. Bioorg Med Chem Lett 23:5684-8 (2013)  
Target
Name:
Calcitonin gene-related peptide type 1 receptor
Synonyms:
Adrenomedullin receptor AM1; CALCRL/RAMP2 CALRL_HUMAN CGRP type 1 receptor mRNA Calcitonin gene-related peptide (CGRP) receptor Calcitonin receptor-like receptor Human CL receptor
Type:
Enzyme Catalytic Domain
Mol. Mass.:
52980.45
Organism:
Homo sapiens (Human)
Description:
Q16602
Residue:
461
  
Inhibitor
Name:
BDBM50441049
Synonyms:
CHEMBL2430171
Type:
Small organic molecule
Emp. Form.:
C33H35N9O2
Mol. Mass.:
589.6901
SMILES:
Cc1cc(CC(NC(=O)N2CCC(CC2)N2Cc3ccccc3NC2=O)c2nccn2Cc2ccccn2)cc2cn[nH]c12
: