Target
Calcitonin gene-related peptide type 1 receptor
Ligand
BDBM50441053
Substrate
Meas. Tech.
ChEMBL_985765 (CHEMBL2433982)
IC50
120±n/a nM
Citation
 Tora, GDegnan, APConway, CMKostich, WADavis, CDPin, SSSchartman, RXu, CWidmann, KAMacor, JEDubowchik, GM Preparation of imidazoles as potent calcitonin gene-related peptide (CGRP) antagonists. Bioorg Med Chem Lett 23:5684-8 (2013)  
Target
Name:
Calcitonin gene-related peptide type 1 receptor
Synonyms:
Adrenomedullin receptor AM1; CALCRL/RAMP2 CALRL_HUMAN CGRP type 1 receptor mRNA Calcitonin gene-related peptide (CGRP) receptor Calcitonin receptor-like receptor Human CL receptor
Type:
Enzyme Catalytic Domain
Mol. Mass.:
52980.45
Organism:
Homo sapiens (Human)
Description:
Q16602
Residue:
461
  
Inhibitor
Name:
BDBM50441053
Synonyms:
CHEMBL2430175
Type:
Small organic molecule
Emp. Form.:
C28H32N8O2
Mol. Mass.:
512.6061
SMILES:
Cc1cnc([nH]1)C(Cc1cc(C)c2[nH]ncc2c1)NC(=O)N1CCC(CC1)N1Cc2ccccc2NC1=O
: