Target
E3 ubiquitin-protein ligase XIAP
Ligand
BDBM50441344
Substrate
Meas. Tech.
ChEMBL_984067 (CHEMBL2434425)
IC50
104±n/a nM
Citation
 Donnell, AFMichoud, CRupert, KCHan, XAguilar, DFrank, KBFretland, AJGao, LGoggin, BHogg, JHHong, KJanson, CAKester, RFKong, NLe, KLi, SLiang, WLombardo, LJLou, YLukacs, CMMischke, SMoliterni, JAPolonskaia, ASchutt, ADSolis, DSSpecian, ATaylor, RTWeisel, MRemiszewski, SW Benzazepinones and benzoxazepinones as antagonists of inhibitor of apoptosis proteins (IAPs) selective for the second baculovirus IAP repeat (BIR2) domain. J Med Chem 56:7772-87 (2013)  
Target
Name:
E3 ubiquitin-protein ligase XIAP
Synonyms:
API3 E3 ubiquitin-protein ligase XIAP Inhibitor of apoptosis protein 3 X-linked inhibitor of apoptosis XIAP | XIAP_HUMAN
Type:
Protein
Mol. Mass.:
56685.27
Organism:
Homo sapiens (Human)
Description:
P98170
Residue:
497
  
Inhibitor
Name:
BDBM50441344
Synonyms:
CHEMBL2431763 | US9611224, Example 10
Type:
Small organic molecule
Emp. Form.:
C26H28BrN3O4
Mol. Mass.:
526.422
SMILES:
COc1ccc2cc(Br)ccc2c1CN1c2ccccc2CC[C@H](NC(=O)[C@@H](N)[C@H](C)O)C1=O
: