Target
E3 ubiquitin-protein ligase XIAP
Ligand
BDBM50441346
Substrate
Meas. Tech.
ChEMBL_984067 (CHEMBL2434425)
IC50
1910±n/a nM
Citation
 Donnell, AFMichoud, CRupert, KCHan, XAguilar, DFrank, KBFretland, AJGao, LGoggin, BHogg, JHHong, KJanson, CAKester, RFKong, NLe, KLi, SLiang, WLombardo, LJLou, YLukacs, CMMischke, SMoliterni, JAPolonskaia, ASchutt, ADSolis, DSSpecian, ATaylor, RTWeisel, MRemiszewski, SW Benzazepinones and benzoxazepinones as antagonists of inhibitor of apoptosis proteins (IAPs) selective for the second baculovirus IAP repeat (BIR2) domain. J Med Chem 56:7772-87 (2013)  
Target
Name:
E3 ubiquitin-protein ligase XIAP
Synonyms:
API3 E3 ubiquitin-protein ligase XIAP Inhibitor of apoptosis protein 3 X-linked inhibitor of apoptosis XIAP | XIAP_HUMAN
Type:
Protein
Mol. Mass.:
56685.27
Organism:
Homo sapiens (Human)
Description:
P98170
Residue:
497
  
Inhibitor
Name:
BDBM50441346
Synonyms:
CHEMBL2431761 | US9611224, Example 27
Type:
Small organic molecule
Emp. Form.:
C26H28BrN3O3
Mol. Mass.:
510.423
SMILES:
CN[C@H](C)C(=O)N[C@H]1CCc2ccccc2N(Cc2c(OC)ccc3cc(Br)ccc23)C1=O
: