Target
Substance-P receptor
Ligand
BDBM50442585
Substrate
Meas. Tech.
ChEMBL_990559 (CHEMBL2447334)
Ki
0.031600±n/a nM
Citation
 Di Fabio, RAlvaro, GBraggio, SCarletti, RGerrard, PAGriffante, CMarchioro, CPozzan, AMelotto, SPoffe, APiccoli, LRatti, ETranquillini, ETrower, MSpada, SCorsi, M Identification, biological characterization and pharmacophoric analysis of a new potent and selective NK1 receptor antagonist clinical candidate. Bioorg Med Chem 21:6264-73 (2013)  
Target
Name:
Substance-P receptor
Synonyms:
NK-1 receptor NK1 Receptor Neurokinin 1 receptor SPR Tac1r Tacr1
Type:
G Protein-Coupled Receptor (GPCR)
Mol. Mass.:
46371.54
Organism:
Rattus norvegicus (rat)
Description:
Competition binding assays were carried out using membrane preparations from transfected CHO cells that constitutively expressed the rat NK1 receptor.
Residue:
407
  
Inhibitor
Name:
BDBM50442585
Synonyms:
GW823296X | ORVEPITANT
Type:
Small organic molecule
Emp. Form.:
C31H35F7N4O2
Mol. Mass.:
628.624
SMILES:
C[C@@H](N(C)C(=O)N1CC[C@@H](C[C@@H]1c1ccc(F)cc1C)N1CCN2[C@@H](CCC2=O)C1)c1cc(cc(c1)C(F)(F)F)C(F)(F)F
: