Target
ATP-sensitive inward rectifier potassium channel 10
Ligand
BDBM50442600
Substrate
Meas. Tech.
ChEMBL_990652 (CHEMBL2443474)
IC50
>10000±n/a nM
Citation
 Tang, Hde Jesus, RKWalsh, SPZhu, YYan, YPriest, BTSwensen, AMAlonso-Galicia, MFelix, JPBrochu, RMBailey, TThomas-Fowlkes, BZhou, XPai, LYHampton, CHernandez, MOwens, KRoy, SKaczorowski, GJYang, LGarcia, MLPasternak, A Discovery of a novel sub-class of ROMK channel inhibitors typified by 5-(2-(4-(2-(4-(1H-Tetrazol-1-yl)phenyl)acetyl)piperazin-1-yl)ethyl)isobenzofuran-1(3H)-one. Bioorg Med Chem Lett 23:5829-32 (2013)  
Target
Name:
ATP-sensitive inward rectifier potassium channel 10
Synonyms:
ATP-dependent inwardly rectifying potassium channel Kir4.1 KCJ10_HUMAN Potassium channel, inwardly rectifying subfamily J member 10
Type:
PROTEIN
Mol. Mass.:
42513.64
Organism:
Homo sapiens (Human)
Description:
ChEMBL_105175
Residue:
379
  
Inhibitor
Name:
BDBM50442600
Synonyms:
CHEMBL2441437 | US9056859, 1
Type:
Small organic molecule
Emp. Form.:
C23H24N6O3
Mol. Mass.:
432.4751
SMILES:
O=C(Cc1ccc(cc1)-n1cnnn1)N1CCN(CCc2ccc3C(=O)OCc3c2)CC1
: