Target
D(3) dopamine receptor
Ligand
BDBM50442755
Substrate
Meas. Tech.
ChEMBL_989366 (CHEMBL2443401)
Ki
7600±n/a nM
Citation
 Banerjee, AMaschauer, SHübner, HGmeiner, PPrante, O Click chemistry based synthesis of dopamine D4 selective receptor ligands for the selection of potential PET tracers. Bioorg Med Chem Lett 23:6079-82 (2013)  
Target
Name:
D(3) dopamine receptor
Synonyms:
DOPAMINE D3 DRD3_HUMAN Dopamine D3 receptor (D3) Dopamine receptor Dopamine receptor D3
Type:
Mol. Mass.:
44243.43
Organism:
Homo sapiens (Human)
Description:
Residue:
400
  
Inhibitor
Name:
BDBM50442755
Synonyms:
CHEMBL2443001
Type:
Small organic molecule
Emp. Form.:
C22H34FN5O4
Mol. Mass.:
451.5349
SMILES:
COc1ccccc1N1CCN(Cc2cn(CCOCCOCCOCCF)nn2)CC1
: