Target
Solute carrier organic anion transporter family member 1B1
Ligand
BDBM50442892
Substrate
Meas. Tech.
ChEMBL_1265863 (CHEMBL3039489)
IC50
977±n/a nM
Citation
 De Bruyn, Tvan Westen, GJIjzerman, APStieger, Bde Witte, PAugustijns, PFAnnaert, PP Structure-based identification of OATP1B1/3 inhibitors. Mol Pharmacol 83:1257-67 (2013)  
Target
Name:
Solute carrier organic anion transporter family member 1B1
Synonyms:
LST1 OATP2 SLC21A6 SO1B1_HUMAN Solute carrier organic anion transporter family member 1B1 (OATP1B1) | Thromboxane B2
Type:
Protein
Mol. Mass.:
76468.06
Organism:
Homo sapiens (Human)
Description:
Q9Y6L6
Residue:
691
  
Inhibitor
Name:
BDBM50442892
Synonyms:
Benicar OLMESARTAN MEDOXOMIL
Type:
Small organic molecule
Emp. Form.:
C29H30N6O6
Mol. Mass.:
558.5851
SMILES:
CCCc1nc(c(C(=O)OCc2oc(=O)oc2C)n1Cc1ccc(cc1)-c1ccccc1-c1nnn[nH]1)C(C)(C)O
: