Target
Neuropeptide S receptor
Ligand
BDBM50443391
Substrate
Meas. Tech.
ChEMBL_1276607 (CHEMBL3088892)
IC50
5.3±n/a nM
Citation
 Patnaik, SMarugan, JJLiu, KZheng, WSouthall, NDehdashti, SJThorsell, AHeilig, MBell, LZook, MEskay, BBrimacombe, KRAustin, CP Structure-activity relationship of imidazopyridinium analogues as antagonists of neuropeptide s receptor. J Med Chem 56:9045-56 (2013)  
Target
Name:
Neuropeptide S receptor
Synonyms:
GPR154 NPSR1 PGR14
Type:
PROTEIN
Mol. Mass.:
42692.30
Organism:
Homo sapiens (Human)
Description:
ChEMBL_1276607
Residue:
371
  
Inhibitor
Name:
BDBM50443391
Synonyms:
CHEMBL469695
Type:
Small organic molecule
Emp. Form.:
C26H24FN3O3
Mol. Mass.:
445.4855
SMILES:
Fc1ccc(CNC(=O)N2CCN3C(C2)C(OC3=O)(c2ccccc2)c2ccccc2)cc1
: