Target
Neuropeptide S receptor
Ligand
BDBM89034
Substrate
Meas. Tech.
ChEMBL_1276605 (CHEMBL3088890)
IC50
30±n/a nM
Citation
 Patnaik, SMarugan, JJLiu, KZheng, WSouthall, NDehdashti, SJThorsell, AHeilig, MBell, LZook, MEskay, BBrimacombe, KRAustin, CP Structure-activity relationship of imidazopyridinium analogues as antagonists of neuropeptide s receptor. J Med Chem 56:9045-56 (2013)  
Target
Name:
Neuropeptide S receptor
Synonyms:
GPR154 NPSR1 PGR14
Type:
PROTEIN
Mol. Mass.:
42692.30
Organism:
Homo sapiens (Human)
Description:
ChEMBL_1276607
Residue:
371
  
Inhibitor
Name:
BDBM89034
Synonyms:
(1,2-dimethyl-3-imidazo[1,2-a]pyridin-4-iumyl)-diphenyl-sulfanylidenephosphorane;methyl sulfate (1,2-dimethylimidazo[1,2-a]pyridin-4-ium-3-yl)-diphenyl-thioxo-phosphorane;methyl sulfate MLS002703110 cid_56643192
Type:
Small organic molecule
Emp. Form.:
C21H20N2PS
Mol. Mass.:
363.435
SMILES:
Cc1c([n+]2ccccc2n1C)P(=S)(c1ccccc1)c1ccccc1
: