Target
Neuropeptide S receptor
Ligand
BDBM50443392
Substrate
Meas. Tech.
ChEMBL_1276606 (CHEMBL3088891)
IC50
13±n/a nM
Citation
 Patnaik, SMarugan, JJLiu, KZheng, WSouthall, NDehdashti, SJThorsell, AHeilig, MBell, LZook, MEskay, BBrimacombe, KRAustin, CP Structure-activity relationship of imidazopyridinium analogues as antagonists of neuropeptide s receptor. J Med Chem 56:9045-56 (2013)  
Target
Name:
Neuropeptide S receptor
Synonyms:
GPR154 NPSR1 PGR14
Type:
PROTEIN
Mol. Mass.:
42692.30
Organism:
Homo sapiens (Human)
Description:
ChEMBL_1276607
Residue:
371
  
Inhibitor
Name:
BDBM50443392
Synonyms:
CHEMBL1472563
Type:
Small organic molecule
Emp. Form.:
C31H32N2PS
Mol. Mass.:
495.637
SMILES:
Cc1c(n2ccccc2[n+]1CCCCCc1ccccc1)P(=S)(c1ccccc1)c1ccccc1
: