Target
Neuropeptide S receptor
Ligand
BDBM50443417
Substrate
Meas. Tech.
ChEMBL_1276615 (CHEMBL3088900)
IC50
27±n/a nM
Citation
 Patnaik, SMarugan, JJLiu, KZheng, WSouthall, NDehdashti, SJThorsell, AHeilig, MBell, LZook, MEskay, BBrimacombe, KRAustin, CP Structure-activity relationship of imidazopyridinium analogues as antagonists of neuropeptide s receptor. J Med Chem 56:9045-56 (2013)  
Target
Name:
Neuropeptide S receptor
Synonyms:
GPR154 NPSR1 PGR14
Type:
PROTEIN
Mol. Mass.:
42692.30
Organism:
Homo sapiens (Human)
Description:
ChEMBL_1276607
Residue:
371
  
Inhibitor
Name:
BDBM50443417
Synonyms:
CHEMBL3086828
Type:
Small organic molecule
Emp. Form.:
C26H24N2O2
Mol. Mass.:
396.481
SMILES:
O=C1c2ccccc2C(=O)C1(N1CCN(Cc2ccccc2)CC1)c1ccccc1
: