Target
Toll-like receptor 4
Ligand
BDBM50443419
Substrate
Meas. Tech.
ChEMBL_1277125 (CHEMBL3088701)
IC50
167500±n/a nM
Citation
 Švajger, UBrus, BTurk, SSova, MHodnik, VAnderluh, GGobec, S Novel toll-like receptor 4 (TLR4) antagonists identified by structure- and ligand-based virtual screening. Eur J Med Chem 70:393-9 (2013)  
Target
Name:
Toll-like receptor 4
Synonyms:
TLR4 TLR4_HUMAN
Type:
PROTEIN
Mol. Mass.:
95675.49
Organism:
Homo sapiens (Human)
Description:
ChEMBL_1436169
Residue:
839
  
Inhibitor
Name:
BDBM50443419
Synonyms:
CHEMBL3087261
Type:
Small organic molecule
Emp. Form.:
C26H27N5O3S
Mol. Mass.:
489.589
SMILES:
CN(CC(=O)Nc1ccc(cc1)N1CCOCC1)Cc1nc2scc(-c3ccccc3)c2c(=O)[nH]1
: