Target
Coagulation factor X
Ligand
BDBM7840
Substrate
Meas. Tech.
ChEMBL_1277822 (CHEMBL3097588)
Ki
0.400000±n/a nM
Citation
 Meneyrol, JFollmann, MLassalle, GWehner, VBarre, GRousseaux, TAltenburger, JMPetit, FBocskei, ZSchreuder, HAlet, NHerault, JPMillet, LDol, FFlorian, PSchaeffer, PSadoun, FKlieber, SBriot, CBono, FHerbert, JM 5-Chlorothiophene-2-carboxylic acid [(S)-2-[2-methyl-3-(2-oxopyrrolidin-1-yl)benzenesulfonylamino]-3-(4-methylpiperazin-1-yl)-3-oxopropyl]amide (SAR107375), a selective and potent orally active dual thrombin and factor Xa inhibitor. J Med Chem 56:9441-56 (2014)  
Target
Name:
Coagulation factor X
Synonyms:
Activated coagulation factor X (FXa) Coagulation factor X precursor F10 Factor X heavy chain Factor Xa Stuart-Prower factor
Type:
Enzyme
Mol. Mass.:
54726.60
Organism:
Homo sapiens (Human)
Description:
Residue:
488
  
Inhibitor
Name:
BDBM7840
Synonyms:
RIVAROXABAN US8822458, 97
Type:
Emp. Form.:
C19H18ClN3O5S
Mol. Mass.:
435.881
SMILES:
Clc1ccc(s1)C(=O)NC[C@H]1CN(C(=O)O1)c1ccc(cc1)N1CCOCC1=O
: