Target
Myeloblastin
Ligand
BDBM50444297
Substrate
Meas. Tech.
ChEMBL_1278123 (CHEMBL3095811)
IC50
5900±n/a nM
Citation
 Lucas, SDGonçalves, LMCarvalho, LACorreia, HFDa Costa, EMGuedes, RAMoreira, RGuedes, RC Optimization of O3-acyl kojic acid derivatives as potent and selective human neutrophil elastase inhibitors. J Med Chem 56:9802-6 (2014)  
Target
Name:
Myeloblastin
Synonyms:
Leukocyte proteinase 3 PRTN3 | PRTN3_HUMAN
Type:
PROTEIN
Mol. Mass.:
27816.30
Organism:
Homo sapiens (Human)
Description:
ChEMBL_1463425
Residue:
256
  
Inhibitor
Name:
BDBM50444297
Synonyms:
CHEMBL3093815
Type:
Small organic molecule
Emp. Form.:
C18H17NO4S2
Mol. Mass.:
375.462
SMILES:
CC(C)(C)C(=O)Oc1coc(CSc2nc3ccccc3s2)cc1=O
: