Target
Neutrophil elastase
Ligand
BDBM50084637
Substrate
Meas. Tech.
ChEMBL_1278122 (CHEMBL3095810)
IC50
10.0±n/a nM
Citation
 Lucas, SDGonçalves, LMCarvalho, LACorreia, HFDa Costa, EMGuedes, RAMoreira, RGuedes, RC Optimization of O3-acyl kojic acid derivatives as potent and selective human neutrophil elastase inhibitors. J Med Chem 56:9802-6 (2014)  
Target
Name:
Neutrophil elastase
Synonyms:
Bone marrow serine protease Coagulation factor X ELANE Elastase HLE Leukocyte elastase Medullasin Neutrophil elastase (HNE) PMN elastase Trypsin
Type:
Enzyme
Mol. Mass.:
28532.38
Organism:
Homo sapiens (Human)
Description:
P08246
Residue:
267
  
Inhibitor
Name:
BDBM50084637
Synonyms:
2,2-Dimethyl-propionic acid 4-[2-(carboxymethyl-carbamoyl)-phenylsulfamoyl]-phenyl ester CHEMBL76688 Sivelestat
Type:
Small organic molecule
Emp. Form.:
C20H22N2O7S
Mol. Mass.:
434.463
SMILES:
CC(C)(C)C(=O)Oc1ccc(cc1)S(=O)(=O)Nc1ccccc1C(=O)NCC(O)=O
: