Target
Neutrophil elastase
Ligand
BDBM50444300
Substrate
Meas. Tech.
ChEMBL_1278122 (CHEMBL3095810)
IC50
280±n/a nM
Citation
 Lucas, SDGonçalves, LMCarvalho, LACorreia, HFDa Costa, EMGuedes, RAMoreira, RGuedes, RC Optimization of O3-acyl kojic acid derivatives as potent and selective human neutrophil elastase inhibitors. J Med Chem 56:9802-6 (2014)  
Target
Name:
Neutrophil elastase
Synonyms:
Bone marrow serine protease Coagulation factor X ELANE Elastase HLE Leukocyte elastase Medullasin Neutrophil elastase (HNE) PMN elastase Trypsin
Type:
Enzyme
Mol. Mass.:
28532.38
Organism:
Homo sapiens (Human)
Description:
P08246
Residue:
267
  
Inhibitor
Name:
BDBM50444300
Synonyms:
CHEMBL3093808
Type:
Small organic molecule
Emp. Form.:
C26H18N2O3S2
Mol. Mass.:
470.563
SMILES:
O=C(Oc1cn(c(CSc2nc3ccccc3s2)cc1=O)-c1ccccc1)c1ccccc1
: