Target
Neutrophil elastase
Ligand
BDBM50444301
Substrate
Meas. Tech.
ChEMBL_1278122 (CHEMBL3095810)
IC50
300±n/a nM
Citation
 Lucas, SDGonçalves, LMCarvalho, LACorreia, HFDa Costa, EMGuedes, RAMoreira, RGuedes, RC Optimization of O3-acyl kojic acid derivatives as potent and selective human neutrophil elastase inhibitors. J Med Chem 56:9802-6 (2014)  
Target
Name:
Neutrophil elastase
Synonyms:
Bone marrow serine protease Coagulation factor X ELANE Elastase HLE Leukocyte elastase Medullasin Neutrophil elastase (HNE) PMN elastase Trypsin
Type:
Enzyme
Mol. Mass.:
28532.38
Organism:
Homo sapiens (Human)
Description:
P08246
Residue:
267
  
Inhibitor
Name:
BDBM50444301
Synonyms:
CHEMBL3093809
Type:
Small organic molecule
Emp. Form.:
C25H24N2O3S2
Mol. Mass.:
464.6
SMILES:
CCC(CC)C(=O)Oc1cn(c(CSc2nc3ccccc3s2)cc1=O)-c1ccccc1
: