Target
Neutrophil elastase
Ligand
BDBM50444296
Substrate
Meas. Tech.
ChEMBL_1278122 (CHEMBL3095810)
IC50
180±n/a nM
Citation
 Lucas, SDGonçalves, LMCarvalho, LACorreia, HFDa Costa, EMGuedes, RAMoreira, RGuedes, RC Optimization of O3-acyl kojic acid derivatives as potent and selective human neutrophil elastase inhibitors. J Med Chem 56:9802-6 (2014)  
Target
Name:
Neutrophil elastase
Synonyms:
Bone marrow serine protease Coagulation factor X ELANE Elastase HLE Leukocyte elastase Medullasin Neutrophil elastase (HNE) PMN elastase Trypsin
Type:
Enzyme
Mol. Mass.:
28532.38
Organism:
Homo sapiens (Human)
Description:
P08246
Residue:
267
  
Inhibitor
Name:
BDBM50444296
Synonyms:
CHEMBL3093814
Type:
Small organic molecule
Emp. Form.:
C19H17NO7S
Mol. Mass.:
403.406
SMILES:
CC(C)(C)C(=O)Oc1coc(CSc2nc3cc(ccc3o2)C(O)=O)cc1=O
: