Target
Neutrophil elastase
Ligand
BDBM50444312
Substrate
Meas. Tech.
ChEMBL_1278122 (CHEMBL3095810)
IC50
450±n/a nM
Citation
 Lucas, SDGonçalves, LMCarvalho, LACorreia, HFDa Costa, EMGuedes, RAMoreira, RGuedes, RC Optimization of O3-acyl kojic acid derivatives as potent and selective human neutrophil elastase inhibitors. J Med Chem 56:9802-6 (2014)  
Target
Name:
Neutrophil elastase
Synonyms:
Bone marrow serine protease Coagulation factor X ELANE Elastase HLE Leukocyte elastase Medullasin Neutrophil elastase (HNE) PMN elastase Trypsin
Type:
Enzyme
Mol. Mass.:
28532.38
Organism:
Homo sapiens (Human)
Description:
P08246
Residue:
267
  
Inhibitor
Name:
BDBM50444312
Synonyms:
CHEMBL3093821
Type:
Small organic molecule
Emp. Form.:
C20H19N3O5S2
Mol. Mass.:
445.512
SMILES:
CC(C)(C)C(=O)Oc1coc(CSc2nnc(NC(=O)c3ccccc3)s2)cc1=O
: