Target
Nuclear receptor ROR-alpha
Ligand
BDBM50444335
Substrate
Meas. Tech.
ChEMBL_1279572 (CHEMBL3097485)
EC50
7000±n/a nM
Citation
 Fauber, BPde Leon Boenig, GBurton, BEidenschenk, CEverett, CGobbi, AHymowitz, SGJohnson, ARLiimatta, MLockey, PNorman, MOuyang, WRené, OWong, H Structure-based design of substituted hexafluoroisopropanol-arylsulfonamides as modulators of RORc. Bioorg Med Chem Lett 23:6604-9 (2013)  
Target
Name:
Nuclear receptor ROR-alpha
Synonyms:
NR1F1 Nuclear receptor subfamily 1 group F member 1 RORA RZRA | Retinoid-related orphan receptor-alpha
Type:
PROTEIN
Mol. Mass.:
58976.26
Organism:
Homo sapiens (Human)
Description:
ChEMBL_101591
Residue:
523
  
Inhibitor
Name:
BDBM50444335
Synonyms:
CHEMBL3094367
Type:
Small organic molecule
Emp. Form.:
C18H11F9N2O3S
Mol. Mass.:
506.342
SMILES:
OC(c1ccc(cc1)N(CC(F)(F)F)S(=O)(=O)c1ccc(cc1)C#N)(C(F)(F)F)C(F)(F)F
: