Target
Dual specificity tyrosine-phosphorylation-regulated kinase 1B
Ligand
BDBM50444365
Substrate
Meas. Tech.
ChEMBL_1279587 (CHEMBL3097669)
IC50
11±n/a nM
Citation
 Anderson, KChen, YChen, ZDominique, RGlenn, KHe, YJanson, CLuk, KCLukacs, CPolonskaia, AQiao, QRailkar, ARossman, PSun, HXiang, QVilenchik, MWovkulich, PZhang, X Pyrido[2,3-d]pyrimidines: discovery and preliminary SAR of a novel series of DYRK1B and DYRK1A inhibitors. Bioorg Med Chem Lett 23:6610-5 (2013)  
Target
Name:
Dual specificity tyrosine-phosphorylation-regulated kinase 1B
Synonyms:
DYR1B_HUMAN Dual specificity tyrosine-phosphorylation-regulated kinase 1B MIRK
Type:
Enzyme
Mol. Mass.:
69222.24
Organism:
Homo sapiens (Human)
Description:
Q9Y463
Residue:
629
  
Inhibitor
Name:
BDBM50444365
Synonyms:
CHEMBL3094462
Type:
Small organic molecule
Emp. Form.:
C25H22Cl2N6O4
Mol. Mass.:
541.386
SMILES:
COc1ncc2cc(C(=O)Nc3cc(ccc3Cl)C(=O)NC(CCN)c3cccc(Cl)c3)c(=O)[nH]c2n1
: