Target
Indoleamine 2,3-dioxygenase 1
Ligand
BDBM50444455
Substrate
Meas. Tech.
ChEMBL_1280717 (CHEMBL3097526)
IC50
250±n/a nM
Citation
 Fung, SPWang, HTomek, PSquire, CJFlanagan, JUPalmer, BDBridewell, DJTijono, SMJamie, JFChing, LM Discovery and characterisation of hydrazines as inhibitors of the immune suppressive enzyme, indoleamine 2,3-dioxygenase 1 (IDO1). Bioorg Med Chem 21:7595-603 (2013)  
Target
Name:
Indoleamine 2,3-dioxygenase 1
Synonyms:
I23O1_HUMAN IDO-1 INDO Indoleamine 2,3-dioxygenase | Indoleamine-pyrrole 2,3-dioxygenase
Type:
Enzyme
Mol. Mass.:
45330.80
Organism:
Homo sapiens (Human)
Description:
P14902
Residue:
403
  
Inhibitor
Name:
BDBM50444455
Synonyms:
CHEBI:27924 | Phenylhydrazine
Type:
Small organic molecule
Emp. Form.:
C6H8N2
Mol. Mass.:
108.1411
SMILES:
NNc1ccccc1
: