Target
Indoleamine 2,3-dioxygenase 1
Ligand
BDBM50444456
Substrate
Meas. Tech.
ChEMBL_1280717 (CHEMBL3097526)
IC50
8000±n/a nM
Citation
 Fung, SPWang, HTomek, PSquire, CJFlanagan, JUPalmer, BDBridewell, DJTijono, SMJamie, JFChing, LM Discovery and characterisation of hydrazines as inhibitors of the immune suppressive enzyme, indoleamine 2,3-dioxygenase 1 (IDO1). Bioorg Med Chem 21:7595-603 (2013)  
Target
Name:
Indoleamine 2,3-dioxygenase 1
Synonyms:
I23O1_HUMAN IDO-1 INDO Indoleamine 2,3-dioxygenase | Indoleamine-pyrrole 2,3-dioxygenase
Type:
Enzyme
Mol. Mass.:
45330.80
Organism:
Homo sapiens (Human)
Description:
P14902
Residue:
403
  
Inhibitor
Name:
BDBM50444456
Synonyms:
2-Hydrazinylbenzo[D]Thiazole | CHEMBL1933308
Type:
Small organic molecule
Emp. Form.:
C7H7N3S
Mol. Mass.:
165.216
SMILES:
NNc1nc2ccccc2s1
: