Target
Cytochrome P450 11B2, mitochondrial
Ligand
BDBM50444548
Substrate
Meas. Tech.
ChEMBL_1281886 (CHEMBL3101039)
IC50
24±n/a nM
Citation
 Meredith, ELKsander, GMonovich, LGPapillon, JPLiu, QMiranda, KMorris, PRao, CBurgis, RCapparelli, MHu, QYSingh, ARigel, DFJeng, AYBeil, MFu, FHu, CWLaSala, D Discovery and in Vivo Evaluation of Potent Dual CYP11B2 (Aldosterone Synthase) and CYP11B1 Inhibitors. ACS Med Chem Lett 4:1203-7 (2013)  
Target
Name:
Cytochrome P450 11B2, mitochondrial
Synonyms:
Aldosterone synthase CYPXIB2 Cyp11b2 Cytochrome P450 11B2 P450-Aldo-1 | Steroid 11-beta-hydroxylase
Type:
PROTEIN
Mol. Mass.:
58260.64
Organism:
Rattus norvegicus
Description:
ChEMBL_224979
Residue:
510
  
Inhibitor
Name:
BDBM50444548
Synonyms:
CHEMBL3099696
Type:
Small organic molecule
Emp. Form.:
C14H13N3
Mol. Mass.:
223.2731
SMILES:
Cc1cc(ccc1[C@H]1CCc2cncn12)C#N
: