Target
Cytochrome P450 11B2, mitochondrial
Ligand
BDBM50444551
Substrate
Meas. Tech.
ChEMBL_1281888 (CHEMBL3101041)
IC50
3.2±n/a nM
Citation
 Meredith, ELKsander, GMonovich, LGPapillon, JPLiu, QMiranda, KMorris, PRao, CBurgis, RCapparelli, MHu, QYSingh, ARigel, DFJeng, AYBeil, MFu, FHu, CWLaSala, D Discovery and in Vivo Evaluation of Potent Dual CYP11B2 (Aldosterone Synthase) and CYP11B1 Inhibitors. ACS Med Chem Lett 4:1203-7 (2013)  
Target
Name:
Cytochrome P450 11B2, mitochondrial
Synonyms:
Aldosterone Synthase (CYP11B2) Aldosterone-synthesizing enzyme CYP11B2 Cytochrome P450 11B2 Cytochrome P450 11B2, mitochondrial P-450C18 | Steroid 18-hydroxylase
Type:
Protein
Mol. Mass.:
57582.15
Organism:
Homo sapiens (Human)
Description:
P19099
Residue:
503
  
Inhibitor
Name:
BDBM50444551
Synonyms:
CHEMBL3099683
Type:
Small organic molecule
Emp. Form.:
C15H14FN3
Mol. Mass.:
255.2902
SMILES:
Fc1cc(ccc1[C@H]1CCCCc2cncn12)C#N
: